FailedConsole Output

Started by an SCM change
Building in workspace /var/lib/jenkins/workspace/JXMPP-CI
 > git rev-parse --is-inside-work-tree # timeout=10
Fetching changes from the remote Git repository
 > git config remote.origin.url https://github.com/igniterealtime/jxmpp.git # timeout=10
Fetching upstream changes from https://github.com/igniterealtime/jxmpp.git
 > git --version # timeout=10
 > git fetch --tags --progress https://github.com/igniterealtime/jxmpp.git +refs/heads/*:refs/remotes/origin/*
 > git rev-parse refs/remotes/origin/master^{commit} # timeout=10
 > git rev-parse refs/remotes/origin/origin/master^{commit} # timeout=10
Checking out Revision 9e30141e14a027592d0483589ee947feeebaff00 (refs/remotes/origin/master)
 > git config core.sparsecheckout # timeout=10
 > git checkout -f 9e30141e14a027592d0483589ee947feeebaff00
Commit message: "Add new XmppXmlSplitter constructor with XmlPrinter parameter"
 > git rev-list --no-walk 817a08d379c5138d8db7a28d9a9f67c632781a43 # timeout=10
[Gradle] - Launching build.
[JXMPP-CI] $ gradle clean check
Starting a Gradle Daemon, 28 busy Daemons could not be reused, use --status for details

FAILURE: Build failed with an exception.

* Where:
Build file '/var/lib/jenkins/workspace/JXMPP-CI/build.gradle' line: 19

* What went wrong:
An exception occurred applying plugin request [id: 'me.champeau.gradle.jmh', version: '0.4.5']
> Failed to apply plugin [id 'me.champeau.gradle.jmh']
   > Could not generate a proxy class for class me.champeau.gradle.JMHPluginExtension.

* Try:
Run with --stacktrace option to get the stack trace. Run with --info or --debug option to get more log output.

BUILD FAILED

Total time: 24.748 secs
Build step 'Invoke Gradle script' changed build result to FAILURE
Build step 'Invoke Gradle script' marked build as failure
Recording test results
ERROR: Step ‘Publish JUnit test result report’ failed: Test reports were found but none of them are new. Did leafNodes run? 
For example, /var/lib/jenkins/workspace/JXMPP-CI/jxmpp-core/build/test-results/test/TEST-org.jxmpp.util.XmppDateTimeTest.xml is 11 mo old

Finished: FAILURE