FailedConsole Output

Started by an SCM change
Running as SYSTEM
Building in workspace /var/lib/jenkins/workspace/JXMPP-CI
No credentials specified
 > git rev-parse --is-inside-work-tree # timeout=10
Fetching changes from the remote Git repository
 > git config remote.origin.url https://github.com/igniterealtime/jxmpp.git # timeout=10
Fetching upstream changes from https://github.com/igniterealtime/jxmpp.git
 > git --version # timeout=10
 > git fetch --tags --progress https://github.com/igniterealtime/jxmpp.git +refs/heads/*:refs/remotes/origin/*
 > git rev-parse refs/remotes/origin/master^{commit} # timeout=10
 > git rev-parse refs/remotes/origin/origin/master^{commit} # timeout=10
Checking out Revision 92f4e510d040c3de0f5ab42c1edd314478fdd132 (refs/remotes/origin/master)
 > git config core.sparsecheckout # timeout=10
 > git checkout -f 92f4e510d040c3de0f5ab42c1edd314478fdd132
Commit message: "gradle: Bump Error Prone (Plugin) to 2.3.3 (0.8.1)"
 > git rev-list --no-walk d66a486c7258d50b783ad9b269eab074d2d747a1 # timeout=10
[Gradle] - Launching build.
[JXMPP-CI] $ gradle clean check
Starting a Gradle Daemon, 28 busy Daemons could not be reused, use --status for details
Download https://plugins.gradle.org/m2/net/ltgt/gradle/gradle-errorprone-plugin/0.8.1/gradle-errorprone-plugin-0.8.1.pom
Download https://plugins.gradle.org/m2/net/ltgt/gradle/gradle-errorprone-plugin/0.8.1/gradle-errorprone-plugin-0.8.1.jar

FAILURE: Build failed with an exception.

* What went wrong:
kotlin/jvm/internal/Intrinsics
> kotlin.jvm.internal.Intrinsics

* Try:
Run with --stacktrace option to get the stack trace. Run with --info or --debug option to get more log output.

BUILD FAILED

Total time: 42.51 secs
Build step 'Invoke Gradle script' changed build result to FAILURE
Build step 'Invoke Gradle script' marked build as failure
Recording test results
ERROR: Step ‘Publish JUnit test result report’ failed: Test reports were found but none of them are new. Did leafNodes run? 
For example, /var/lib/jenkins/workspace/JXMPP-CI/jxmpp-core/build/test-results/test/TEST-org.jxmpp.util.XmppDateTimeTest.xml is 1 yr 10 mo old

Finished: FAILURE