FailedConsole Output

Started by an SCM change
Running as SYSTEM
Building in workspace /var/lib/jenkins/workspace/JXMPP-CI
No credentials specified
 > git rev-parse --is-inside-work-tree # timeout=10
Fetching changes from the remote Git repository
 > git config remote.origin.url https://github.com/igniterealtime/jxmpp.git # timeout=10
Fetching upstream changes from https://github.com/igniterealtime/jxmpp.git
 > git --version # timeout=10
 > git fetch --tags --force --progress -- https://github.com/igniterealtime/jxmpp.git +refs/heads/*:refs/remotes/origin/* # timeout=10
 > git rev-parse refs/remotes/origin/master^{commit} # timeout=10
 > git rev-parse refs/remotes/origin/origin/master^{commit} # timeout=10
Checking out Revision 944bbf23e532672f38d041f054b5c42d6a24b48b (refs/remotes/origin/master)
 > git config core.sparsecheckout # timeout=10
 > git checkout -f 944bbf23e532672f38d041f054b5c42d6a24b48b # timeout=10
Commit message: "jxmpp: 0.7.0-beta1-SNAPSHOT"
 > git rev-list --no-walk 310fbeb7f0c202bc26c9b234778818a1b4b9d5e2 # timeout=10
[Gradle] - Launching build.
[JXMPP-CI] $ gradle clean check
Starting a Gradle Daemon, 28 busy Daemons could not be reused, use --status for details

FAILURE: Build failed with an exception.

* What went wrong:
kotlin/jvm/internal/Intrinsics
> kotlin.jvm.internal.Intrinsics

* Try:
Run with --stacktrace option to get the stack trace. Run with --info or --debug option to get more log output.

BUILD FAILED

Total time: 44.497 secs
Build step 'Invoke Gradle script' changed build result to FAILURE
Build step 'Invoke Gradle script' marked build as failure
Recording test results
ERROR: Step ‘Publish JUnit test result report’ failed: Test reports were found but none of them are new. Did leafNodes run? 
For example, /var/lib/jenkins/workspace/JXMPP-CI/jxmpp-core/build/test-results/test/TEST-org.jxmpp.util.XmppDateTimeTest.xml is 2 yr 5 mo old

Finished: FAILURE