FailedConsole Output

Started by an SCM change
Building in workspace /var/lib/jenkins/workspace/XIOT-Nightly
 > git rev-parse --is-inside-work-tree # timeout=10
Fetching changes from the remote Git repository
 > git config remote.origin.url https://github.com/Flowdalic/android-xmpp-iot-demo.git # timeout=10
Cleaning workspace
 > git rev-parse --verify HEAD # timeout=10
Resetting working tree
 > git reset --hard # timeout=10
 > git clean -fdx # timeout=10
 > git submodule foreach --recursive git reset --hard # timeout=10
 > git submodule foreach --recursive git clean -fdx # timeout=10
Fetching upstream changes from https://github.com/Flowdalic/android-xmpp-iot-demo.git
 > git --version # timeout=10
 > git fetch --tags --progress https://github.com/Flowdalic/android-xmpp-iot-demo.git +refs/heads/*:refs/remotes/origin/*
Seen branch in repository origin/dev
Seen branch in repository origin/master
Seen branch in repository origin/mutual-subscription
Seen 3 remote branches
Checking out Revision 25acb76f7002eba8f1d8669bd895941061a97e39 (origin/master)
 > git config core.sparsecheckout # timeout=10
 > git checkout -f 25acb76f7002eba8f1d8669bd895941061a97e39
 > git rev-list 98a93ea758a9f3649ef283c16bb41abc81a7cb3c # timeout=10
 > git remote # timeout=10
 > git submodule init # timeout=10
 > git submodule sync # timeout=10
 > git config --get remote.origin.url # timeout=10
 > git submodule init # timeout=10
 > git config -f .gitmodules --get-regexp ^submodule\.(.*)\.url # timeout=10
 > git config --get submodule.MemorizingTrustManager.url # timeout=10
 > git config -f .gitmodules --get submodule.MemorizingTrustManager.path # timeout=10
 > git submodule update --init --recursive MemorizingTrustManager
[XIOT-Nightly] $ /bin/sh -xe /tmp/jenkins1695973076062197147.sh
+ [ -d releases ]
[XIOT-Nightly] $ /bin/sh -xe /tmp/jenkins4957226424397707247.sh
+ ./scripts/createRelease.sh -r
Downloading https://services.gradle.org/distributions/gradle-3.3-all.zip
.........................................................................................................................................................................................................................................................................................................................................................................................................................................................................................................................................................................................................................................................................................................................................................................................................................................................................................................................................................................................................................................................................................................................................................................................................................................................................................................................................................................................................................................................................................................................................................................................................................................................................................................................................................................................................................................................................................................................................................................................................................................................................................................................................................................................................................................................................................................................................................................................................................................................................................................................................................................................................................................................................................................................................................................................................................................................................................................................................................................................................................................................................................................................................................................................................................................................................................................................................................................................................................................................................................................................................................................................................................................................................................................................................................................................................................................................................................................................................................................................................................................................................................................................................................................................................................................................................................................................................................................................................................................................................................................................................................................................................................................................................................................................................................
Unzipping /var/lib/jenkins/.gradle/wrapper/dists/gradle-3.3-all/55gk2rcmfc6p2dg9u9ohc3hw9/gradle-3.3-all.zip to /var/lib/jenkins/.gradle/wrapper/dists/gradle-3.3-all/55gk2rcmfc6p2dg9u9ohc3hw9
Set executable permissions for: /var/lib/jenkins/.gradle/wrapper/dists/gradle-3.3-all/55gk2rcmfc6p2dg9u9ohc3hw9/gradle-3.3/bin/gradle
Starting a Gradle Daemon (subsequent builds will be faster)
Download https://jcenter.bintray.com/com/android/tools/build/gradle/2.3.0/gradle-2.3.0.pom
Download https://jcenter.bintray.com/com/android/tools/build/gradle-core/2.3.0/gradle-core-2.3.0.pom
Download https://jcenter.bintray.com/com/android/tools/build/builder/2.3.0/builder-2.3.0.pom
Download https://jcenter.bintray.com/com/android/tools/lint/lint/25.3.0/lint-25.3.0.pom
Download https://jcenter.bintray.com/com/android/tools/build/gradle-api/2.3.0/gradle-api-2.3.0.pom
Download https://jcenter.bintray.com/com/android/databinding/compilerCommon/2.3.0/compilerCommon-2.3.0.pom
Download https://jcenter.bintray.com/net/sf/proguard/proguard-gradle/5.3.2/proguard-gradle-5.3.2.pom
Download https://jcenter.bintray.com/net/sf/proguard/proguard-parent/5.3.2/proguard-parent-5.3.2.pom
Download https://jcenter.bintray.com/com/google/protobuf/protobuf-java/3.0.0/protobuf-java-3.0.0.pom
Download https://jcenter.bintray.com/com/google/protobuf/protobuf-parent/3.0.0/protobuf-parent-3.0.0.pom
Download https://jcenter.bintray.com/com/android/tools/build/builder-model/2.3.0/builder-model-2.3.0.pom
Download https://jcenter.bintray.com/com/android/tools/build/builder-test-api/2.3.0/builder-test-api-2.3.0.pom
Download https://jcenter.bintray.com/com/android/tools/sdklib/25.3.0/sdklib-25.3.0.pom
Download https://jcenter.bintray.com/com/android/tools/sdk-common/25.3.0/sdk-common-25.3.0.pom
Download https://jcenter.bintray.com/com/android/tools/common/25.3.0/common-25.3.0.pom
Download https://jcenter.bintray.com/com/android/tools/build/manifest-merger/25.3.0/manifest-merger-25.3.0.pom
Download https://jcenter.bintray.com/com/android/tools/ddms/ddmlib/25.3.0/ddmlib-25.3.0.pom
Download https://jcenter.bintray.com/com/android/tools/jack/jack-api/0.13.0/jack-api-0.13.0.pom
Download https://jcenter.bintray.com/com/android/tools/analytics-library/protos/25.3.0/protos-25.3.0.pom
Download https://jcenter.bintray.com/com/android/tools/analytics-library/shared/25.3.0/shared-25.3.0.pom
Download https://jcenter.bintray.com/com/android/tools/analytics-library/tracker/25.3.0/tracker-25.3.0.pom
Download https://jcenter.bintray.com/com/android/tools/lint/lint-checks/25.3.0/lint-checks-25.3.0.pom
Download https://jcenter.bintray.com/org/eclipse/jdt/core/compiler/ecj/4.6.1/ecj-4.6.1.pom
Download https://jcenter.bintray.com/com/android/databinding/baseLibrary/2.3.0/baseLibrary-2.3.0.pom
Download https://jcenter.bintray.com/net/sf/proguard/proguard-base/5.3.2/proguard-base-5.3.2.pom
Download https://jcenter.bintray.com/com/android/tools/layoutlib/layoutlib-api/25.3.0/layoutlib-api-25.3.0.pom
Download https://jcenter.bintray.com/com/android/tools/dvlib/25.3.0/dvlib-25.3.0.pom
Download https://jcenter.bintray.com/com/android/tools/repository/25.3.0/repository-25.3.0.pom
Download https://jcenter.bintray.com/com/android/tools/lint/lint-api/25.3.0/lint-api-25.3.0.pom
Download https://jcenter.bintray.com/com/android/tools/external/com-intellij/uast/162.2228.14/uast-162.2228.14.pom
Download https://jcenter.bintray.com/com/android/tools/annotations/25.3.0/annotations-25.3.0.pom
Download https://jcenter.bintray.com/com/android/tools/build/gradle/2.3.0/gradle-2.3.0.jar
Download https://jcenter.bintray.com/com/android/tools/build/gradle-core/2.3.0/gradle-core-2.3.0.jar
Download https://jcenter.bintray.com/com/android/tools/build/builder/2.3.0/builder-2.3.0.jar
Download https://jcenter.bintray.com/com/android/tools/lint/lint/25.3.0/lint-25.3.0.jar
Download https://jcenter.bintray.com/com/android/tools/build/gradle-api/2.3.0/gradle-api-2.3.0.jar
Download https://jcenter.bintray.com/com/android/databinding/compilerCommon/2.3.0/compilerCommon-2.3.0.jar
Download https://jcenter.bintray.com/net/sf/proguard/proguard-gradle/5.3.2/proguard-gradle-5.3.2.jar
Download https://jcenter.bintray.com/com/google/protobuf/protobuf-java/3.0.0/protobuf-java-3.0.0.jar
Download https://jcenter.bintray.com/com/android/tools/build/builder-model/2.3.0/builder-model-2.3.0.jar
Download https://jcenter.bintray.com/com/android/tools/build/builder-test-api/2.3.0/builder-test-api-2.3.0.jar
Download https://jcenter.bintray.com/com/android/tools/sdklib/25.3.0/sdklib-25.3.0.jar
Download https://jcenter.bintray.com/com/android/tools/sdk-common/25.3.0/sdk-common-25.3.0.jar
Download https://jcenter.bintray.com/com/android/tools/common/25.3.0/common-25.3.0.jar
Download https://jcenter.bintray.com/com/android/tools/build/manifest-merger/25.3.0/manifest-merger-25.3.0.jar
Download https://jcenter.bintray.com/com/android/tools/ddms/ddmlib/25.3.0/ddmlib-25.3.0.jar
Download https://jcenter.bintray.com/com/android/tools/jack/jack-api/0.13.0/jack-api-0.13.0.jar
Download https://jcenter.bintray.com/com/android/tools/analytics-library/protos/25.3.0/protos-25.3.0.jar
Download https://jcenter.bintray.com/com/android/tools/analytics-library/shared/25.3.0/shared-25.3.0.jar
Download https://jcenter.bintray.com/com/android/tools/analytics-library/tracker/25.3.0/tracker-25.3.0.jar
Download https://jcenter.bintray.com/com/android/tools/lint/lint-checks/25.3.0/lint-checks-25.3.0.jar
Download https://jcenter.bintray.com/org/eclipse/jdt/core/compiler/ecj/4.6.1/ecj-4.6.1.jar
Download https://jcenter.bintray.com/com/android/databinding/baseLibrary/2.3.0/baseLibrary-2.3.0.jar
Download https://jcenter.bintray.com/net/sf/proguard/proguard-base/5.3.2/proguard-base-5.3.2.jar
Download https://jcenter.bintray.com/com/android/tools/layoutlib/layoutlib-api/25.3.0/layoutlib-api-25.3.0.jar
Download https://jcenter.bintray.com/com/android/tools/dvlib/25.3.0/dvlib-25.3.0.jar
Download https://jcenter.bintray.com/com/android/tools/repository/25.3.0/repository-25.3.0.jar
Download https://jcenter.bintray.com/com/android/tools/lint/lint-api/25.3.0/lint-api-25.3.0.jar
Download https://jcenter.bintray.com/com/android/tools/external/com-intellij/uast/162.2228.14/uast-162.2228.14.jar
Download https://jcenter.bintray.com/com/android/tools/annotations/25.3.0/annotations-25.3.0.jar
NDK is missing a "platforms" directory.
If you are using NDK, verify the ndk.dir is set to a valid NDK directory.  It is currently set to /opt/android-sdk-linux/ndk-bundle.
If you are not using NDK, unset the NDK variable from ANDROID_NDK_HOME or local.properties to remove this warning.

Exception while marshalling /opt/android-sdk-linux/build-tools/25.0.1/package.xml. Probably the SDK is read-only
Exception while marshalling /opt/android-sdk-linux/build-tools/25.0.2/package.xml. Probably the SDK is read-only
Exception while marshalling /opt/android-sdk-linux/tools/package.xml. Probably the SDK is read-only
Exception while marshalling /opt/android-sdk-linux/build-tools/25.0.1/package.xml. Probably the SDK is read-only
Exception while marshalling /opt/android-sdk-linux/build-tools/25.0.2/package.xml. Probably the SDK is read-only
Exception while marshalling /opt/android-sdk-linux/tools/package.xml. Probably the SDK is read-only
Incremental java compilation is an incubating feature.
NDK is missing a "platforms" directory.
If you are using NDK, verify the ndk.dir is set to a valid NDK directory.  It is currently set to /opt/android-sdk-linux/ndk-bundle.
If you are not using NDK, unset the NDK variable from ANDROID_NDK_HOME or local.properties to remove this warning.

Download https://jcenter.bintray.com/org/igniterealtime/smack/smack-android-extensions/4.2.0/smack-android-extensions-4.2.0.pom
Download https://jcenter.bintray.com/org/igniterealtime/smack/smack-experimental/4.2.0/smack-experimental-4.2.0.pom
Download https://jcenter.bintray.com/org/igniterealtime/smack/smack-tcp/4.2.0/smack-tcp-4.2.0.pom
Download https://jcenter.bintray.com/org/igniterealtime/smack/smack-android/4.2.0/smack-android-4.2.0.pom
Download https://jcenter.bintray.com/org/igniterealtime/smack/smack-extensions/4.2.0/smack-extensions-4.2.0.pom
Download https://jcenter.bintray.com/org/igniterealtime/smack/smack-core/4.2.0/smack-core-4.2.0.pom
Download https://jcenter.bintray.com/org/igniterealtime/smack/smack-im/4.2.0/smack-im-4.2.0.pom
Download https://jcenter.bintray.com/org/igniterealtime/smack/smack-resolver-minidns/4.2.0/smack-resolver-minidns-4.2.0.pom
Download https://jcenter.bintray.com/org/igniterealtime/smack/smack-sasl-provided/4.2.0/smack-sasl-provided-4.2.0.pom
WARNING: WARNING: Dependency xpp3:xpp3:1.1.4c is ignored for debug as it may be conflicting with the internal version provided by Android.
         In case of problem, please repackage it with jarjar to change the class packages
Download https://jcenter.bintray.com/org/igniterealtime/smack/smack-core/4.2.0/smack-core-4.2.0.jar
Download https://jcenter.bintray.com/org/igniterealtime/smack/smack-im/4.2.0/smack-im-4.2.0.jar
Download https://jcenter.bintray.com/org/igniterealtime/smack/smack-resolver-minidns/4.2.0/smack-resolver-minidns-4.2.0.jar
Download https://jcenter.bintray.com/org/igniterealtime/smack/smack-sasl-provided/4.2.0/smack-sasl-provided-4.2.0.jar
Download https://jcenter.bintray.com/org/igniterealtime/smack/smack-android/4.2.0/smack-android-4.2.0.jar
Download https://jcenter.bintray.com/org/igniterealtime/smack/smack-extensions/4.2.0/smack-extensions-4.2.0.jar
Download https://jcenter.bintray.com/org/igniterealtime/smack/smack-android-extensions/4.2.0/smack-android-extensions-4.2.0.jar
Download https://jcenter.bintray.com/org/igniterealtime/smack/smack-experimental/4.2.0/smack-experimental-4.2.0.jar
Download https://jcenter.bintray.com/org/igniterealtime/smack/smack-tcp/4.2.0/smack-tcp-4.2.0.jar
WARNING: WARNING: Dependency xpp3:xpp3:1.1.4c is ignored for debug as it may be conflicting with the internal version provided by Android.
         In case of problem, please repackage it with jarjar to change the class packages
WARNING: WARNING: Dependency xpp3:xpp3:1.1.4c is ignored for release as it may be conflicting with the internal version provided by Android.
         In case of problem, please repackage it with jarjar to change the class packages
WARNING: WARNING: Dependency xpp3:xpp3:1.1.4c is ignored for release as it may be conflicting with the internal version provided by Android.
         In case of problem, please repackage it with jarjar to change the class packages
WARNING: WARNING: Dependency xpp3:xpp3:1.1.4c is ignored for debugAndroidTest as it may be conflicting with the internal version provided by Android.
         In case of problem, please repackage it with jarjar to change the class packages
WARNING: WARNING: Dependency xpp3:xpp3:1.1.4c is ignored for debugAndroidTest as it may be conflicting with the internal version provided by Android.
         In case of problem, please repackage it with jarjar to change the class packages
NDK is missing a "platforms" directory.
If you are using NDK, verify the ndk.dir is set to a valid NDK directory.  It is currently set to /opt/android-sdk-linux/ndk-bundle.
If you are not using NDK, unset the NDK variable from ANDROID_NDK_HOME or local.properties to remove this warning.

Exception while marshalling /opt/android-sdk-linux/build-tools/25.0.1/package.xml. Probably the SDK is read-only
Exception while marshalling /opt/android-sdk-linux/build-tools/25.0.2/package.xml. Probably the SDK is read-only
Exception while marshalling /opt/android-sdk-linux/tools/package.xml. Probably the SDK is read-only
File /var/lib/jenkins/.android/repositories.cfg could not be loaded.
Checking the license for package Android Support Repository in /opt/android-sdk-linux/licenses
Warning: License for package Android Support Repository not accepted.

FAILURE: Build failed with an exception.

* What went wrong:
A problem occurred configuring project ':app'.
> You have not accepted the license agreements of the following SDK components:
  [Android Support Repository].
  Before building your project, you need to accept the license agreements and complete the installation of the missing components using the Android Studio SDK Manager.
  Alternatively, to learn how to transfer the license agreements from one workstation to another, go to http://d.android.com/r/studio-ui/export-licenses.html

* Try:
Run with --info or --debug option to get more log output.

* Exception is:
org.gradle.api.ProjectConfigurationException: A problem occurred configuring project ':app'.
	at org.gradle.configuration.project.LifecycleProjectEvaluator.addConfigurationFailure(LifecycleProjectEvaluator.java:94)
	at org.gradle.configuration.project.LifecycleProjectEvaluator.notifyAfterEvaluate(LifecycleProjectEvaluator.java:89)
	at org.gradle.configuration.project.LifecycleProjectEvaluator.doConfigure(LifecycleProjectEvaluator.java:76)
	at org.gradle.configuration.project.LifecycleProjectEvaluator.access$000(LifecycleProjectEvaluator.java:33)
	at org.gradle.configuration.project.LifecycleProjectEvaluator$1.execute(LifecycleProjectEvaluator.java:53)
	at org.gradle.configuration.project.LifecycleProjectEvaluator$1.execute(LifecycleProjectEvaluator.java:50)
	at org.gradle.internal.Transformers$4.transform(Transformers.java:169)
	at org.gradle.internal.progress.DefaultBuildOperationExecutor.run(DefaultBuildOperationExecutor.java:106)
	at org.gradle.internal.progress.DefaultBuildOperationExecutor.run(DefaultBuildOperationExecutor.java:61)
	at org.gradle.configuration.project.LifecycleProjectEvaluator.evaluate(LifecycleProjectEvaluator.java:50)
	at org.gradle.api.internal.project.DefaultProject.evaluate(DefaultProject.java:628)
	at org.gradle.api.internal.project.DefaultProject.evaluate(DefaultProject.java:129)
	at org.gradle.execution.TaskPathProjectEvaluator.configure(TaskPathProjectEvaluator.java:35)
	at org.gradle.execution.TaskPathProjectEvaluator.configureHierarchy(TaskPathProjectEvaluator.java:62)
	at org.gradle.configuration.DefaultBuildConfigurer.configure(DefaultBuildConfigurer.java:38)
	at org.gradle.initialization.DefaultGradleLauncher$1.execute(DefaultGradleLauncher.java:161)
	at org.gradle.initialization.DefaultGradleLauncher$1.execute(DefaultGradleLauncher.java:158)
	at org.gradle.internal.Transformers$4.transform(Transformers.java:169)
	at org.gradle.internal.progress.DefaultBuildOperationExecutor.run(DefaultBuildOperationExecutor.java:106)
	at org.gradle.internal.progress.DefaultBuildOperationExecutor.run(DefaultBuildOperationExecutor.java:56)
	at org.gradle.initialization.DefaultGradleLauncher.doBuildStages(DefaultGradleLauncher.java:158)
	at org.gradle.initialization.DefaultGradleLauncher.doBuild(DefaultGradleLauncher.java:119)
	at org.gradle.initialization.DefaultGradleLauncher.run(DefaultGradleLauncher.java:102)
	at org.gradle.launcher.exec.GradleBuildController.run(GradleBuildController.java:71)
	at org.gradle.tooling.internal.provider.ExecuteBuildActionRunner.run(ExecuteBuildActionRunner.java:28)
	at org.gradle.launcher.exec.ChainingBuildActionRunner.run(ChainingBuildActionRunner.java:35)
	at org.gradle.launcher.exec.InProcessBuildActionExecuter.execute(InProcessBuildActionExecuter.java:41)
	at org.gradle.launcher.exec.InProcessBuildActionExecuter.execute(InProcessBuildActionExecuter.java:26)
	at org.gradle.tooling.internal.provider.ContinuousBuildActionExecuter.execute(ContinuousBuildActionExecuter.java:75)
	at org.gradle.tooling.internal.provider.ContinuousBuildActionExecuter.execute(ContinuousBuildActionExecuter.java:49)
	at org.gradle.tooling.internal.provider.ServicesSetupBuildActionExecuter.execute(ServicesSetupBuildActionExecuter.java:44)
	at org.gradle.tooling.internal.provider.ServicesSetupBuildActionExecuter.execute(ServicesSetupBuildActionExecuter.java:29)
	at org.gradle.launcher.daemon.server.exec.ExecuteBuild.doBuild(ExecuteBuild.java:67)
	at org.gradle.launcher.daemon.server.exec.BuildCommandOnly.execute(BuildCommandOnly.java:36)
	at org.gradle.launcher.daemon.server.api.DaemonCommandExecution.proceed(DaemonCommandExecution.java:120)
	at org.gradle.launcher.daemon.server.exec.WatchForDisconnection.execute(WatchForDisconnection.java:47)
	at org.gradle.launcher.daemon.server.api.DaemonCommandExecution.proceed(DaemonCommandExecution.java:120)
	at org.gradle.launcher.daemon.server.exec.ResetDeprecationLogger.execute(ResetDeprecationLogger.java:26)
	at org.gradle.launcher.daemon.server.api.DaemonCommandExecution.proceed(DaemonCommandExecution.java:120)
	at org.gradle.launcher.daemon.server.exec.RequestStopIfSingleUsedDaemon.execute(RequestStopIfSingleUsedDaemon.java:34)
	at org.gradle.launcher.daemon.server.api.DaemonCommandExecution.proceed(DaemonCommandExecution.java:120)
	at org.gradle.launcher.daemon.server.exec.ForwardClientInput$2.call(ForwardClientInput.java:74)
	at org.gradle.launcher.daemon.server.exec.ForwardClientInput$2.call(ForwardClientInput.java:72)
	at org.gradle.util.Swapper.swap(Swapper.java:38)
	at org.gradle.launcher.daemon.server.exec.ForwardClientInput.execute(ForwardClientInput.java:72)
	at org.gradle.launcher.daemon.server.api.DaemonCommandExecution.proceed(DaemonCommandExecution.java:120)
	at org.gradle.launcher.daemon.server.exec.LogAndCheckHealth.execute(LogAndCheckHealth.java:55)
	at org.gradle.launcher.daemon.server.api.DaemonCommandExecution.proceed(DaemonCommandExecution.java:120)
	at org.gradle.launcher.daemon.server.exec.LogToClient.doBuild(LogToClient.java:60)
	at org.gradle.launcher.daemon.server.exec.BuildCommandOnly.execute(BuildCommandOnly.java:36)
	at org.gradle.launcher.daemon.server.api.DaemonCommandExecution.proceed(DaemonCommandExecution.java:120)
	at org.gradle.launcher.daemon.server.exec.EstablishBuildEnvironment.doBuild(EstablishBuildEnvironment.java:72)
	at org.gradle.launcher.daemon.server.exec.BuildCommandOnly.execute(BuildCommandOnly.java:36)
	at org.gradle.launcher.daemon.server.api.DaemonCommandExecution.proceed(DaemonCommandExecution.java:120)
	at org.gradle.launcher.daemon.server.exec.StartBuildOrRespondWithBusy$1.run(StartBuildOrRespondWithBusy.java:50)
	at org.gradle.launcher.daemon.server.DaemonStateCoordinator$1.run(DaemonStateCoordinator.java:297)
	at org.gradle.internal.concurrent.ExecutorPolicy$CatchAndRecordFailures.onExecute(ExecutorPolicy.java:54)
	at org.gradle.internal.concurrent.StoppableExecutorImpl$1.run(StoppableExecutorImpl.java:40)
Caused by: java.lang.RuntimeException: You have not accepted the license agreements of the following SDK components:
[Android Support Repository].
Before building your project, you need to accept the license agreements and complete the installation of the missing components using the Android Studio SDK Manager.
Alternatively, to learn how to transfer the license agreements from one workstation to another, go to http://d.android.com/r/studio-ui/export-licenses.html
	at com.android.builder.sdk.DefaultSdkLoader.checkResults(DefaultSdkLoader.java:595)
	at com.android.builder.sdk.DefaultSdkLoader.updateRepositories(DefaultSdkLoader.java:506)
	at com.android.build.gradle.internal.DependencyManager.collectArtifacts(DependencyManager.java:501)
	at com.android.build.gradle.internal.DependencyManager.resolveConfiguration(DependencyManager.java:354)
	at com.android.build.gradle.internal.DependencyManager.resolveDependencies(DependencyManager.java:263)
	at com.android.build.gradle.internal.DependencyManager.resolveDependencies(DependencyManager.java:166)
	at com.android.build.gradle.internal.TaskManager.resolveDependencies(TaskManager.java:375)
	at com.android.build.gradle.internal.VariantManager.lambda$createVariantData$3(VariantManager.java:607)
	at com.android.builder.profile.ThreadRecorder.record(ThreadRecorder.java:81)
	at com.android.build.gradle.internal.VariantManager.createVariantData(VariantManager.java:603)
	at com.android.build.gradle.internal.VariantManager.createVariantDataForProductFlavors(VariantManager.java:793)
	at com.android.build.gradle.internal.VariantManager.populateVariantDataList(VariantManager.java:469)
	at com.android.builder.profile.ThreadRecorder.record(ThreadRecorder.java:81)
	at com.android.build.gradle.internal.VariantManager.createAndroidTasks(VariantManager.java:263)
	at com.android.build.gradle.BasePlugin.lambda$createAndroidTasks$6(BasePlugin.java:601)
	at com.android.builder.profile.ThreadRecorder.record(ThreadRecorder.java:81)
	at com.android.build.gradle.BasePlugin.createAndroidTasks(BasePlugin.java:596)
	at com.android.build.gradle.BasePlugin.lambda$null$4(BasePlugin.java:526)
	at com.android.builder.profile.ThreadRecorder.record(ThreadRecorder.java:81)
	at com.android.build.gradle.BasePlugin.lambda$createTasks$5(BasePlugin.java:522)
	at org.gradle.internal.event.BroadcastDispatch$ActionInvocationHandler.dispatch(BroadcastDispatch.java:93)
	at org.gradle.internal.event.BroadcastDispatch$ActionInvocationHandler.dispatch(BroadcastDispatch.java:82)
	at org.gradle.internal.event.AbstractBroadcastDispatch.dispatch(AbstractBroadcastDispatch.java:44)
	at org.gradle.internal.event.BroadcastDispatch.dispatch(BroadcastDispatch.java:79)
	at org.gradle.internal.event.BroadcastDispatch.dispatch(BroadcastDispatch.java:30)
	at org.gradle.internal.dispatch.ProxyDispatchAdapter$DispatchingInvocationHandler.invoke(ProxyDispatchAdapter.java:93)
	at com.sun.proxy.$Proxy15.afterEvaluate(Unknown Source)
	at org.gradle.configuration.project.LifecycleProjectEvaluator.notifyAfterEvaluate(LifecycleProjectEvaluator.java:82)
	... 56 more


BUILD FAILED

Total time: 1 mins 4.665 secs
Build step 'Execute shell' marked build as failure
Finished: FAILURE